{"text_format":"3","workbook":"xlsx","n_sheets":8,"sheets":["Bestellung_Kunde","Positionen_Handeingabe","Produktliste","Holzart","Qualität","Verwendung","Zusatz","Beispiel"],"not_rendered":{"images":3,"external_links":1,"defined_names":4},"read":"whole","date_system":"1900"}

{"sheet":"Bestellung_Kunde","index":0,"n_rows":219,"n_cols":11,"rows_kept":219,"merged":[[0,1,1,1],[0,2,1,2],[2,1,3,1],[2,2,3,2],[5,1,7,2],[5,4,5,7],[7,4,7,7],[9,1,11,2],[9,4,16,7]]}
[null,"q","Bestellung"]
[]
[null,"q","Offertanfrage"]
[]
[null,"Rechnungsadresse",null,null,"Serie/ Kommission"]
[{"$nulls":10},"IQS Version 1.7"]
[{"$nulls":4},"Liefertermin",{"$nulls":5},"vom 05.04.2023"]
[]
[null,"Lieferadresse",null,null,"Bemerkungen"]
[null,"wie Rechnungsadresse"]
{"$rows_empty":8}
[null,"Zeile","Produkt","Stück","Fertig Länge","Fertig Breite","Fertig Dicke","Zwischentext","Pos.Nr.","Positionstext","Bemerkung"]
[null,1]
[null,2,{"$nulls":5},"-"]
[null,3,{"$nulls":5},"-"]
[null,4,{"$nulls":5},"-"]
[null,5,{"$nulls":5},"-"]
[null,6,{"$nulls":5},"-"]
[null,7,{"$nulls":5},"-"]
[null,8,{"$nulls":5},"-"]
[null,9,{"$nulls":5},"-"]
[null,10,{"$nulls":5},"-"]
[null,11,{"$nulls":5},"-"]
[null,12,{"$nulls":5},"-"]
[null,13,{"$nulls":5},"-"]
[null,14,{"$nulls":5},"-"]
[null,15,{"$nulls":5},"-"]
[null,16,{"$nulls":5},"-"]
[null,17,{"$nulls":5},"-"]
[null,18,{"$nulls":5},"-"]
[null,19,{"$nulls":5},"-"]
[null,20,{"$nulls":5},"-"]
[null,21,{"$nulls":5},"-"]
[null,22,{"$nulls":5},"-"]
[null,23,{"$nulls":5},"-"]
[null,24,{"$nulls":5},"-"]
[null,25,{"$nulls":5},"-"]
[null,26,{"$nulls":5},"-"]
[null,27,{"$nulls":5},"-"]
[null,28,{"$nulls":5},"-"]
[null,29,{"$nulls":5},"-"]
[null,30,{"$nulls":5},"-"]
[null,31,{"$nulls":5},"-"]
[null,32,{"$nulls":5},"-"]
[null,33,{"$nulls":5},"-"]
[null,34,{"$nulls":5},"-"]
[null,35,{"$nulls":5},"-"]
[null,36,{"$nulls":5},"-"]
[null,37,{"$nulls":5},"-"]
[null,38,{"$nulls":5},"-"]
[null,39,{"$nulls":5},"-"]
[null,40,{"$nulls":5},"-"]
[null,41,{"$nulls":5},"-"]
[null,42,{"$nulls":5},"-"]
[null,43,{"$nulls":5},"-"]
[null,44,{"$nulls":5},"-"]
[null,45,{"$nulls":5},"-"]
[null,46,{"$nulls":5},"-"]
[null,47,{"$nulls":5},"-"]
[null,48,{"$nulls":5},"-"]
[null,49,{"$nulls":5},"-"]
[null,50,{"$nulls":5},"-"]
[null,51,{"$nulls":5},"-"]
[null,52,{"$nulls":5},"-"]
[null,53,{"$nulls":5},"-"]
[null,54,{"$nulls":5},"-"]
[null,55,{"$nulls":5},"-"]
[null,56,{"$nulls":5},"-"]
[null,57,{"$nulls":5},"-"]
[null,58,{"$nulls":5},"-"]
[null,59,{"$nulls":5},"-"]
[null,60,{"$nulls":5},"-"]
[null,61,{"$nulls":5},"-"]
[null,62,{"$nulls":5},"-"]
[null,63,{"$nulls":5},"-"]
[null,64,{"$nulls":5},"-"]
[null,65,{"$nulls":5},"-"]
[null,66,{"$nulls":5},"-"]
[null,67,{"$nulls":5},"-"]
[null,68,{"$nulls":5},"-"]
[null,69,{"$nulls":5},"-"]
[null,70,{"$nulls":5},"-"]
[null,71,{"$nulls":5},"-"]
[null,72,{"$nulls":5},"-"]
[null,73,{"$nulls":5},"-"]
[null,74,{"$nulls":5},"-"]
[null,75,{"$nulls":5},"-"]
[null,76,{"$nulls":5},"-"]
[null,77,{"$nulls":5},"-"]
[null,78,{"$nulls":5},"-"]
[null,79,{"$nulls":5},"-"]
[null,80,{"$nulls":5},"-"]
[null,81,{"$nulls":5},"-"]
[null,82,{"$nulls":5},"-"]
[null,83,{"$nulls":5},"-"]
[null,84,{"$nulls":5},"-"]
[null,85,{"$nulls":5},"-"]
[null,86,{"$nulls":5},"-"]
[null,87,{"$nulls":5},"-"]
[null,88,{"$nulls":5},"-"]
[null,89,{"$nulls":5},"-"]
[null,90,{"$nulls":5},"-"]
[null,91,{"$nulls":5},"-"]
[null,92,{"$nulls":5},"-"]
[null,93,{"$nulls":5},"-"]
[null,94,{"$nulls":5},"-"]
[null,95,{"$nulls":5},"-"]
[null,96,{"$nulls":5},"-"]
[null,97,{"$nulls":5},"-"]
[null,98,{"$nulls":5},"-"]
[null,99,{"$nulls":5},"-"]
[null,100,{"$nulls":5},"-"]
[null,101,{"$nulls":5},"-"]
[null,102,{"$nulls":5},"-"]
[null,103,{"$nulls":5},"-"]
[null,104,{"$nulls":5},"-"]
[null,105,{"$nulls":5},"-"]
[null,106,{"$nulls":5},"-"]
[null,107,{"$nulls":5},"-"]
[null,108,{"$nulls":5},"-"]
{"$rows_left_out":93}
{"sheet":"Positionen_Handeingabe","index":1,"n_rows":2,"n_cols":16,"rows_kept":2,"hidden":true}
["Zeile","Holzart","Qualität","Verwendung","Zusatz","Stück","Fertig Länge","Fertig Breite","Fertig Dicke","Zwischentext","Pos.Nr.","Positionstext","Barcode","Benutzer 1","Benutzer 2","Palette"]
[1,{"$f":"VLOOKUP(Bestellung_Kunde!C20,Produktliste!A$4:F$100012,3,FALSE)","v":{"$error":"#N/A"}},{"$f":"VLOOKUP(Bestellung_Kunde!C20,Produktliste!A$4:F$100012,4,FALSE)","v":{"$error":"#N/A"}},{"$f":"VLOOKUP(Bestellung_Kunde!C20,Produktliste!A$4:F$100012,5,FALSE)","v":{"$error":"#N/A"}},{"$f":"VLOOKUP(Bestellung_Kunde!C20,Produktliste!A$4:F$100012,6,FALSE)","v":{"$error":"#N/A"}},{"$f":"_xlfn.NUMBERVALUE(Bestellung_Kunde!D20)","v":0},{"$f":"_xlfn.NUMBERVALUE(Bestellung_Kunde!E20)","v":0},{"$f":"_xlfn.NUMBERVALUE(Bestellung_Kunde!F20)","v":0},{"$f":"_xlfn.NUMBERVALUE(Bestellung_Kunde!G20)","v":0},{"$f":"Bestellung_Kunde!H20","v":0},{"$f":"Bestellung_Kunde!I20","v":0},{"$f":"IF(Bestellung_Kunde!J20=\"\",\"\",Bestellung_Kunde!J20)","v":""}]

{"sheet":"Produktliste","index":2,"n_rows":121,"n_cols":6,"rows_kept":121,"hidden":true}
["Produkte sägerei trachsel ag"]
["Produktbeschrieb","Stammartikelnr","Holzart","Qualität","Verwendung","Zusatz"]
["Preisliste Seite 6"]
["Zuschnitte, tr Fichte, Natur, Flügel 4-seitig (Preisliste 2023, Seite  6)","L201ZO_TVHF","Fichte","TR-DDD Natur","Flügel 4-seitig","Ohne"]
["Zuschnitte, tr Fichte, Natur, Flügel, 4-seitig, Holz-Metall (Preisliste 2023, Seite  6)","L201ZO_TVMF","Fichte","TR-DDD-HM Natur","Flügel 4-seitig","Ohne"]
["Zuschnitte, tr Fichte, Natur, Rahmen 2-seitig (Preisliste 2023, Seite  6)","L201ZO_TVHW","Fichte","TR-DDD Natur","Rahmen winkelseitig","Ohne"]
["Zuschnitte, tr Fichte, Natur, Rahmen 4-seitig (Preisliste 2023, Seite  6, Preis wie Flügel)","L201ZO_TVHW","Fichte","TR-DDD Natur","Rahmen 4-seitig","Ohne"]
["-------------------------------------------------------------------------------------------------------------------------------------------------------"]
["Preisliste Seite 7"]
["Zuschnitte, tr Fichte, thermo, Flügel 4-seitig (Preisliste 2023, Seite  7)","L201ZO_TVHFT","Fichte","TR-DDD Natur","Flügel 4-seitig","Thermo"]
["Zuschnitte, tr Fichte, thermo, Flügel 4-seitig, Holz-Metall (Preisliste 2023, Seite  7)","L201ZO_TVMFT","Fichte","TR-DDD-HM Natur","Flügel 4-seitig","Thermo"]
["Zuschnitte, tr Fichte, thermo, Rahmen 2-seitig (Preisliste 2023, Seite  7)","L201ZO_TVHWT","Fichte","TR-DDD Natur","Rahmen winkelseitig","Thermo"]
["Zuschnitte, tr Fichte, thermo, Rahmen 4-seitig (Preisliste 2023, Seite  7, Preis wie Flügel)","L201ZO_TVHWT","Fichte","TR-DDD Natur","Rahmen 4-seitig","Thermo"]
["-------------------------------------------------------------------------------------------------------------------------------------------------------"]
["Preisliste Seite 8"]
["Zuschnitte, tr optina Futter I, Fichte, Natur, 2-seitig, 1 Anleimer (Preisliste 2023, Seite  8)","L201ZO_JFNW","Fichte","TR-Optina Futter Natur","Rahmen winkelseitig","Ohne"]
["Zuschnitte, tr optina Futter II, Fichte, Natur, 3-seitig, 2 Anleimer (Preisliste 2023, Seite  8)","L201ZO_JFND","Fichte","TR-Optina Futter Natur","Rahmen 1Fl 2Ka","Ohne"]
["Zuschnitte, tr optina III, Futter oder Pfosten-Riegel, Fichte, Natur, 4-seitig, 1 Anleimer (Preisliste 2023, Seite  8)","L201ZO_JFNA","Fichte","TR-Optina Futter Natur","Rahmen 4-seitig","Ohne"]
["-------------------------------------------------------------------------------------------------------------------------------------------------------"]
["Preisliste Seite 9"]
["Zuschnitte, tr staticwood H, Fichte, Natur, Flügel für Holzsysteme 4-seitig (Preisliste 2023, Seite  9)","L201ZO_SHNF","Fichte","TR-Staticwood H Natur","Flügel 4-seitig","Ohne"]
["Zuschnitte, tr staticwood HM, Fichte, Natur, Flügel für Holz-Metallsysteme 4-seitig (Preisliste 2023, Seite  9)","L201ZO_SMNF","Fichte","TR-Staticwood HM Natur","Flügel 4-seitig","Ohne"]
["-------------------------------------------------------------------------------------------------------------------------------------------------------"]
["Preisliste Seite 10"]
["Zuschnitte, tr Tanne, Natur, Flügel 4-seitig (Preisliste 2023, Seite  10)","L202ZO_TVHF","Tanne","TR-DDD Natur","Flügel 4-seitig","Ohne"]
["Zuschnitte, tr Tanne, Natur, Flügel 4-seitig, Holz-Metall  (Preisliste 2023, Seite  10)","L202ZO_TVMF","Tanne","TR-DDD-HM Natur","Flügel 4-seitig","Ohne"]
["Zuschnitte, tr Tanne, Natur, Rahmen 2-seitig (Preisliste 2023, Seite  10)","L202ZO_TVHW","Tanne","TR-DDD Natur","Rahmen winkelseitig","Ohne"]
["Zuschnitte, tr Tanne, Natur, Rahmen 4-seitig (Preisliste 2023, Seite  10, Preis wie Flügel)","L202ZO_TVHW","Tanne","TR-DDD Natur","Rahmen 4-seitig","Ohne"]
["-------------------------------------------------------------------------------------------------------------------------------------------------------"]
["Preisliste Seite 11"]
["Zuschnitte, tr Tanne, gedämpft, Flügel 4-seitig (Preisliste 2023 Seite  11)","L202ZO_TVHFY","Tanne","TR-DDD Natur","Flügel 4-seitig","gedämpft"]
["Zuschnitte, tr Tanne, gedämpft, Flügel 4-seitig, Holz-Metall (Preisliste 2023 Seite  11)","L202ZO_TVMFY","Tanne","TR-DDD-HM Natur","Flügel 4-seitig","gedämpft"]
["Zuschnitte, tr Tanne, gedämpft, Rahmen 2-seitig (Preisliste 2023 Seite  11)","L202ZO_TVHWY","Tanne","TR-DDD Natur","Rahmen winkelseitig","gedämpft"]
["Zuschnitte, tr Tanne, gedämpft, Rahmen 4-seitig (Preisliste 2023 Seite  11, Preis wie Flügel)","L202ZO_TVHWY","Tanne","TR-DDD Natur","Rahmen 4-seitig","gedämpft"]
["-------------------------------------------------------------------------------------------------------------------------------------------------------"]
["Preisliste Seite 12"]
["Zuschnitte, tr Föhre, Natur, Flügel 4-seitig (Preisliste 2023 Seite  12)","L204ZO_TVHF","Föhre","TR-DDD Natur","Flügel 4-seitig","Ohne"]
["Zuschnitte, tr Föhre, Natur, Flügel 4-seitig, Holz-Metall (Preisliste 2023 Seite  12)","L204ZO_TVMF","Föhre","TR-DDD-HM Natur","Flügel 4-seitig","Ohne"]
["Zuschnitte, tr Föhre, Natur, Rahmen 2-seitig (Preisliste 2023 Seite  12)","L204ZO_TVHW","Föhre","TR-DDD Natur","Rahmen winkelseitig","Ohne"]
["Zuschnitte, tr Föhre, Natur, Rahmen 4-seitig (Preisliste 2023 Seite  12, Preis wie Flügel)","L204ZO_TVHW","Föhre","TR-DDD Natur","Rahmen 4-seitig","Ohne"]
["-------------------------------------------------------------------------------------------------------------------------------------------------------"]
["Preisliste Seite 13"]
["Zuschnitte, tr Douglas europäisch, Natur, Flügel 4-seitig (Preisliste 2023 Seite  13)","L22ZO_TVHF","europ Douglas","TR-DDD Natur","Flügel 4-seitig","Ohne"]
["Zuschnitte, tr Douglas europäisch, Natur, Flügel 4-seitig, Holz-Metall (Preisliste 2023 Seite  13)","L222ZO_TVMF","europ Douglas","TR-DDD-HM Natur","Flügel 4-seitig","Ohne"]
["Zuschnitte, tr Douglas europäisch, Natur, Rahmen 2-seitig (Preisliste 2023 Seite  13)","L222ZO_TVHW","europ Douglas","TR-DDD Natur","Rahmen winkelseitig","Ohne"]
["Zuschnitte, tr Douglas europäisch, Natur, Rahmen 4-seitig (Preisliste 2023 Seite  13, Preis wie Flügel)","L222ZO_TVHW","europ Douglas","TR-DDD Natur","Rahmen 4-seitig","Ohne"]
["-------------------------------------------------------------------------------------------------------------------------------------------------------"]
["Preisliste Seite 14"]
["Zuschnitte, tr Lärche, europäisch, Natur, ddd, Flügel 4-seitig (Preisliste 2023 Seite  14)","L221ZO_TVHF","europ Lärche","TR-DDD Natur","Flügel 4-seitig","Ohne"]
["Zuschnitte, tr Lärche, europäisch, Natur, ddd, Flügel 4-seitig, Holz-Metall (Preisliste 2023 Seite  14)","L221ZO_TVMF","europ Lärche","TR-DDD-HM Natur","Flügel 4-seitig","Ohne"]
["Zuschnitte, tr Lärche, europäisch, Natur, ddd, Rahmen 2-seitig (Preisliste 2023 Seite  14)","L221ZO_TVHW","europ Lärche","TR-DDD Natur","Rahmen winkelseitig","Ohne"]
["Zuschnitte, tr Lärche, europäisch, Natur, ddd, Rahmen 4-seitig (Preisliste 2023 Seite  14, Preis wie Flügel)","L221ZO_TVHW","europ Lärche","TR-DDD Natur","Rahmen 4-seitig","Ohne"]
["-------------------------------------------------------------------------------------------------------------------------------------------------------"]
["Preisliste Seite 15"]
["Zuschnitte, tr Lärche, europäisch, Natur, dkd, Flügel 4-seitig (Preisliste 2023 Seite  15)","L221ZO_OQOF","europ Lärche","TR-DKD Natur","Flügel 4-seitig","Ohne"]
["Zuschnitte, tr Lärche, europäisch, Natur, dkd, Rahmen 2-seitig (Preisliste 2023 Seite  15)","L221ZO_OQOA","europ Lärche","TR-DKD Natur","Rahmen winkelseitig","Ohne"]
["Zuschnitte, tr Lärche, europäisch, Natur, dkd, Rahmen 4-seitig (Preisliste 2023 Seite  15, Pris wie Flügel)","L221ZO_OQOA","europ Lärche","TR-DKD Natur","Rahmen 4-seitig","Ohne"]
["Zuschnitte, tr optina Futter I, Lärche, europäisch, Natur,  2-seitig, 1 Anleimer (Preisliste 2023 Seite  15)","L221ZO_OFNW","europ Lärche","TR-Optina Futter Natur","Rahmen winkelseitig","Ohne"]
["Zuschnitte, tr optina Futter II, Lärche, europäisch, Natur,  3-seitig, 2 Anleimer (Preisliste 2023 Seite  15)","L221ZO_OFND","europ Lärche","TR-Optina Futter Natur","Rahmen 1Fl 2Ka","Ohne"]
["Zuschnitte, tr optina III Futter oder Pfosten-Riegel, Lärche, europäisch, Natur,  4-seitig, 1 Anleimer (Preisliste 2023 Seite  15)","L221ZO_OFNA","europ Lärche","TR-Optina Futter Natur","Rahmen 4-seitig","Ohne"]
["-------------------------------------------------------------------------------------------------------------------------------------------------------"]
["Preisliste Seite 16"]
["Zuschnitte, tr Eiche, europäisch, Natur, ddd, Flügel 4-seitig (Preisliste 2023 Seite  16)","L224ZO_TVHF","europ Eiche","TR-DDD Natur","Flügel 4-seitig","Ohne"]
["Zuschnitte, tr Eiche, europäisch, Natur, ddd, Flügel 4-seitig, Holz-Metall (Preisliste 2023 Seite  16)","L224ZO_TVMF","europ Eiche","TR-DDD-HM Natur","Flügel 4-seitig","Ohne"]
["Zuschnitte, tr Eiche, europäisch, Natur, ddd, Rahmen 2-seitig (Preisliste 2023 Seite  16)","L224ZO_TVHW","europ Eiche","TR-DDD Natur","Rahmen winkelseitig","Ohne"]
["Zuschnitte, tr Eiche, europäisch, Natur, ddd, Rahmen 4-seitig (Preisliste 2023 Seite  16, Preis wie Flügel)","L224ZO_TVHW","europ Eiche","TR-DDD Natur","Rahmen 4-seitig","Ohne"]
["-------------------------------------------------------------------------------------------------------------------------------------------------------"]
["Preisliste Seite 17"]
["Zuschnitte, Eiche, europäisch, Natur, dkd, Flügel 4-seitig (Preisliste 2023 Seite  17)","L224ZO_OQOF","europ Eiche","IMP-DKD Natur","Flügel 4-seitig","Ohne"]
["Zuschnitte, Eiche, europäisch, Natur, dkd, Rahmen 4-seitig (Preisliste 2023 Seite  17)","L224ZO_OQOA","europ Eiche","IMP-DKD Natur","Rahmen 4-seitig","Ohne"]
["Zuschnitte, optina Futter II, Eiche, europäisch, Natur,  3-seitig, 2 Anleimer (Preisliste 2023 Seite  17)","L224ZO_OFND","europ Eiche","TR-Optina Futter Natur","Rahmen 1Fl 2Ka","Ohne"]
["Zuschnitte, optina III Futter oder Pfosten-Riegel, Eiche, europäisch, Natur,  4-seitig, 1 Anleimer (Preisliste 2023 Seite 17)","L224ZO_OFNA","europ Eiche","TR-Optina Futter Natur","Rahmen 4-seitig","Ohne"]
["-------------------------------------------------------------------------------------------------------------------------------------------------------"]
["Preisliste Seite 20"]
["Zuschnitte, tr Fichte, zum Streichen, ungezinkt, Flügel 4-seitig (Preisliste 2023 Seite 20)","L201ZO_TTHF","Fichte","TR-DDD Streicher","Flügel 4-seitig","Ohne"]
["Zuschnitte, tr Fichte, zum Streichen, ungezinkt, Flügel 4-seitig, Holz-Metall (Preisliste 2023 Seite 20)","L201ZO_TTMF","Fichte","TR-DDD-HM Streicher","Flügel 4-seitig","Ohne"]
["Zuschnitte, tr Fichte, zum Streichen, ungezinkt, Rahmen 2-seitig (Preisliste 2023 Seite  20)","L201ZO_TTHW","Fichte","TR-DDD Streicher","Rahmen winkelseitig","Ohne"]
["Zuschnitte, tr Fichte, zum Streichen, ungezinkt, Rahmen 4-seitig (Preisliste 2023 Seite  20, Preis wie Flügel)","L201ZO_TTHW","Fichte","TR-DDD Streicher","Rahmen 4-seitig","Ohne"]
["-------------------------------------------------------------------------------------------------------------------------------------------------------"]
["Preisliste Seite 21"]
["Zuschnitte, tr Fichte, zum Streichen, Flügel 4-seitig (Preisliste 2023 Seite 21)","L201ZO_TXHF","Fichte","TR-KKK Streicher","Flügel 4-seitig","Ohne"]
["Zuschnitte, tr Fichte, zum Streichen, Flügel 4-seitig, Holz-Metall  (Preisliste 2023 Seite 21)","L201ZO_TXMF","Fichte","TR-KKK-HM Streicher","Flügel 4-seitig","Ohne"]
["Zuschnitte, tr Fichte, zum Streichen, Rahmen 2-seitig (Preisliste 2023 Seite 21)","L201ZO_TXHW","Fichte","TR-KKK Streicher","Rahmen winkelseitig","Ohne"]
["Zuschnitte, tr Fichte, zum Streichen, Rahmen 4-seitig (Preisliste 2023 Seite 21, Preis wie Flügel)","L201ZO_TXHW","Fichte","TR-KKK Streicher","Rahmen 4-seitig","Ohne"]
["-------------------------------------------------------------------------------------------------------------------------------------------------------"]
["Preisliste Seite 22"]
["Zuschnitte, tr Tanne, zum Streichen, ungezinkt, Flügel 4-seitig (Preisliste 2023 Seite 22)","L202ZO_TTHF","Tanne","TR-DDD Streicher","Flügel 4-seitig","Ohne"]
["Zuschnitte, tr Tanne, zum Streichen, ungezinkt, Flügel 4-seitig, Holz-Metall (Preisliste 2023 Seite 22)","L202ZO_TTMF","Tanne","TR-DDD-HM Streicher","Flügel 4-seitig","Ohne"]
["Zuschnitte, tr Tanne, zum Streichen, ungezinkt, Rahmen 2-seitig (Preisliste 2023 Seite 22)","L202ZO_TTHW","Tanne","TR-DDD Streicher","Rahmen winkelseitig","Ohne"]
["Zuschnitte, tr Tanne, zum Streichen, ungezinkt, Rahmen 4-seitig (Preisliste 2023 Seite 22, Preis wie Flügel)","L202ZO_TTHW","Tanne","TR-DDD Streicher","Rahmen 4-seitig","Ohne"]
["-------------------------------------------------------------------------------------------------------------------------------------------------------"]
["Preisliste Seite 23"]
["Zuschnitte, tr Fichte/Tanne, zum Streichen, Flügel 4-seitig (Preisliste 2023 Seite 23)","L203ZO_TXHF","Fi/Ta","TR-KKK Streicher","Flügel 4-seitig","Ohne"]
["Zuschnitte, tr Fichte/Tanne, zum Streichen, Flügel 4-seitig, Holz-Metall (Preisliste 2023 Seite 23)","L203ZO_TXMF","Fi/Ta","TR-KKK-HM Streicher","Flügel 4-seitig","Ohne"]
["Zuschnitte, tr Fichte/Tanne, zum Streichen, Rahmen 2-seitig (Preisliste 2023 Seite 23)","L203ZO_TXHW","Fi/Ta","TR-KKK Streicher","Rahmen winkelseitig","Ohne"]
["Zuschnitte, tr Fichte/Tanne, zum Streichen, Rahmen 4-seitig (Preisliste 2023 Seite 23, Preis wie Flügel)","L203ZO_TXHW","Fi/Ta","TR-KKK Streicher","Rahmen 4-seitig","Ohne"]
["-------------------------------------------------------------------------------------------------------------------------------------------------------"]
["Preisliste Seite 24"]
["Zuschnitte, tr optina Futter I, Fichte/Tanne, zum Streichen, 2-seitig, 1 Anleimer (Preisliste 2023 Seite 24)","L203ZO_JFSW","Fichte","TR-Optina Futter Streicher","Rahmen winkelseitig","Ohne"]
["Zuschnitte, tr optina Futter II, Fichte/Tanne, zum Streichen, 3-seitig, 2 Anleimer (Preisliste 2023 Seite 24)","L203ZO_JFSD","Fichte","TR-Optina Futter Streicher","Rahmen 1Fl 2Ka","Ohne"]
["Zuschnitte, tr optina III, Futter oder Pfosten-Riegel, Fichte/Tanne, zum Streichen, 4-seitig, 1 Anleimer (Preisliste 2023 Seite 24)","L203ZO_JFSA","Fichte","TR-Optina Futter Streicher","Rahmen 4-seitig","Ohne"]
["-------------------------------------------------------------------------------------------------------------------------------------------------------"]
["Preisliste Seite 25"]
["Zuschnitte, tr staticwood H, Fichte/Tanne, zum Streichen, Flügel für Holzsysteme 4-seitig (Preisliste 2023 Seite 25)","L203ZO_SHSF","Fichte","TR-Staticwood H Streicher","Flügel 4-seitig","Ohne"]
["Zuschnitte, tr staticwood HM, Fichte/Tanne, zumStreichen, Flügel für Holz-Metallsysteme 4-seitig (Preisliste 2023 Seite 25)","L203ZO_SMSF","Fichte","TR-Staticwood HM Streicher","Flügel 4-seitig","Ohne"]
["-------------------------------------------------------------------------------------------------------------------------------------------------------"]
["Preisliste Seite 26"]
["Zuschnitte, Eiche, zum Streichen, keilgezinkt, Flügel 4-seitig (Preisliste 2023 Seite 26)","L224ZO_OXOF","europ Eiche","IMP-KKK Streicher","Flügel 4-seitig","Ohne"]
["Zuschnitte, Eiche, zum Streichen, keilgezinkt, Rahmen 4-seitig (Preisliste 2023 Seite 26)","L224ZO_OXOA","europ Eiche","IMP-KKK Streicher","Rahmen 4-seitig","Ohne"]
["Zuschnitte, Eiche, zum Streichen, keilgezinkt, Flügel 4-seitig, Brandschutz(Preisliste 2023 Seite 26)","L224ZO_OXOFB","europ Eiche","IMP-KKK Streicher","Flügel 4-seitig","Brandschutz"]
["Zuschnitte, Eiche, zum Streichen, keilgezinkt, Rahmen 4-seitig, Brandschutz (Preisliste 2023 Seite 26)","L224ZO_OXOAB","europ Eiche","IMP-KKK Streicher","Rahmen 4-seitig","Brandschutz"]
["Zuschnitte, Buche, zum Streichen, keilgezinkt, Flügel 4-seitig (Preisliste 2023 Seite 26)","L226ZO_OXOF","Buche","IMP-KKK Streicher","Flügel 4-seitig","Ohne"]
["Zuschnitte, Buche, zum Streichen, keilgezinkt, Rahmen 4-seitig (Preisliste 2023 Seite 26)","L226ZO_OXOA","Buche","IMP-KKK Streicher","Rahmen 4-seitig","Ohne"]
["Zuschnitte, Accoya, zum Streichen, ungezinkt, Flügel 4-seitig (Preisliste 2023 Seite 26)","L219ZO_OTHF","Accoya","IMP-DDD Streicher","Flügel 4-seitig","Ohne"]
["Zuschnitte, Accoya, zum Streichen, ungezinkt, Rahmen 4-seitig (Preisliste 2023 Seite 26)","L219ZO_OTHA","Accoya","IMP-DDD Streicher","Rahmen 4-seitig","Ohne"]
["-------------------------------------------------------------------------------------------------------------------------------------------------------"]
["Preisliste basic"]
["Zuschnitte, basic Fichte, zum Streichen kkk, Flügel 4-seitig (PL basic Seite  1)","L201ZO_OXOF","Fichte","IMP-KKK Streicher","Flügel 4-seitig","Ohne"]
["Zuschnitte, basic Fichte, zum Streichen kkk, Rahmen 4-seitig  (PL basic Seite  1)","L201ZO_OXOF","Fichte","IMP-KKK Streicher","Rahmen 4-seitig","Ohne"]
["Zuschnitte, basic Föhre, zum Streichen kkk, Flügel 4-seitig (PL basic Seite  1)","L204ZO_OXOF","Föhre","IMP-KKK Streicher","Flügel 4-seitig","Ohne"]
{"$rows_left_out":2}
{"sheet":"Holzart","index":3,"n_rows":13,"n_cols":5,"rows_kept":13,"hidden":true}
["ID","HolzartKurz","HolzartLang","Holzart","HolzartFranz"]
[1,"Fi","Fichte","01","épicéa"]
[2,"Ta","Tanne","02","sapin"]
[3,"FT","Fi/Ta","03","ép/sap"]
[4,"Fö","Föhre","04","pin"]
[12,"Sp","Spezialholz","11","bois spécial"]
[66,"SpAu","Spezialausführung","12","execution spéciale"]
[68,"LäE","europ Lärche","21","mélèze europ"]
[69,"DoE","europ Douglas","22","douglas europ"]
[71,"EiE","europ Eiche","24","chêne europ"]
[73,"Buc","Buche","26","hêtre"]
[76,"AC","Accoya","19","accoya"]
[75,"Div","Diverse","00","divers"]

{"sheet":"Qualität","index":4,"n_rows":28,"n_cols":5,"rows_kept":28,"hidden":true}
["ID","QualitaetKurz","QualitaetLang","Qualitaet","QualitaetFranz"]
[87,"OFT-N","TR-Optina Futter Natur","JFN","tr-optina huisserie naturel"]
[88,"OFT-S","TR-Optina Futter Streicher","JFS","tr-optina huisserie à peindre"]
[89,"STA-N","TR-Staticwood H Natur","SHN","tr-staticwood b naturel"]
[90,"STA-S","TR-Staticwood H Streicher","SHS","tr-staticwood b à  peindre"]
[91,"mSTA-N","TR-Staticwood HM Natur","SMN","tr-staticwood bm naturel"]
[92,"mSTA-S","TR-Staticwood HM Streicher","SMS","tr-staticwood bm à peindre"]
[93,"DDD-N","TR-DDD Natur","TVH","tr-ddd naturel"]
[94,"mDDD-N","TR-DDD-HM Natur","TVM","tr-ddd-bm naturel"]
[95,"DKD-N","TR-DKD Natur","TQH","tr-dkd naturel"]
[96,"DDK-N","TR-DDK Natur","TRH","tr-ddk naturel"]
[97,"DKK-N","TR-DKK Natur","TSH","tr-dkk naturel"]
[98,"DDD-S","TR-DDD Streicher","TTH","tr-ddd à peindre"]
[99,"mDDD-S","TR-DDD-HM Streicher","TTM","tr-ddd-bm à peindre"]
[100,"KKK-S","TR-KKK Streicher","TXH","tr-kkk à peindre"]
[101,"mKKK-S","TR-KKK-HM Streicher","TXM","tr-kkk-bm à peindre"]
[102,"iDDD","IMP-DDD Natur","OVO","imp-ddd naturel"]
[103,"iDKD","IMP-DKD Natur","OQO","imp-dkd naturel"]
[106,"iKKK","IMP-KKK Streicher","OXO","imp-kkk à peindre"]
[107,"iYYY-N","IMP-Natur Qualität gem. Beschrieb","OYN","imp-naturel qualité selon description"]
[108,"iYYY-S","IMP-Streicher Qualität gem. Beschrieb","OYS","imp-à peindre qualité selon description"]
[109,"BL-","Blindholz","OBL","non visible"]
[119,"YYY-N","TR-Natur Qualität gem. Beschrieb","TYN","tr-naturel qualité selon description"]
[120,"YYY-S","TR-Streicher Qualität gem. Beschrieb","TYS","tr-à peindre qualité selon description"]
[121,"iOFT-N","IMP Optina Futter Natur","OFN","imp optina huisserie naturel"]
[122,"iOFT-S","IMP Optina Futter z. Streichen","OFS","imp optina huisserie à peindre"]
[126,"mDKD-N","TR-DKD-HM Natur","TQM","tr-dkd-bm naturel"]
[127,"iOTH","IMP-DDD Streicher","OTH","imp-ddd à peindre"]

{"sheet":"Verwendung","index":5,"n_rows":8,"n_cols":7,"rows_kept":8,"hidden":true}
["ID","VerwendungKurz","VerwendungLang","Verwendung","Verwendungsgruppe","VerwendungFranz","VerwendungIntern"]
[1,"Fl 4s","Flügel 4-seitig","F","FL","guichet 4-faces","Flügel"]
[2,"Ra 2s","Rahmen winkelseitig","W","RA","cadre 2-faces","Rahmen"]
[3,"Ra 4s","Rahmen 4-seitig","A","RA","cadre 4-faces","Flügel"]
[4,"2K1F","Rahmen 1Fl 2Ka","D","RA","cadre 1-face 2chants","Flügel"]
[5,"-","Leer","-","-","vide","-"]
[57,"Fl 2s","Flügel winkelseitig","Z","FL","guichet 2-faces","Flügel"]
[58,"1K2F","Rahmen 2Fl 1Ka","C","RA","cadre 2-faces 1chant","Flügel"]

{"sheet":"Zusatz","index":6,"n_rows":5,"n_cols":5,"rows_kept":5,"hidden":true}
["ID","ZusatzKurz","ZusatzLang","Zusatz","ZusatzFranz"]
[1,"Bran","Brandschutz","B","anti feu"]
[9,"ther","Thermo","T","thermostabilisé"]
[12,"-","Ohne","-","sans"]
[64,"ged","gedämpft","Y","vapotraité"]

{"sheet":"Beispiel","index":7,"n_rows":0,"n_cols":0,"rows_kept":0}